Target
Retinoic acid receptor gamma
Ligand
BDBM50045278
Substrate
Meas. Tech.
ChEBML_163495
EC50
550±n/a nM
Citation
 Jong, LLehmann, JMHobbs, PDHarlev, EHuffman, JCPfahl, MDawson, MI Conformational effects on retinoid receptor selectivity. 1. Effect of 9-double bond geometry on retinoid X receptor activity. J Med Chem 36:2605-13 (1993)  
Target
Name:
Retinoic acid receptor gamma
Synonyms:
NR1B3 RAR-gamma RARG_HUMAN Retinoic acid receptor gamma | Retinoid receptor
Type:
PROTEIN
Mol. Mass.:
50345.43
Organism:
Homo sapiens (Human)
Description:
ChEMBL_1458016
Residue:
454
  
Inhibitor
Name:
BDBM50045278
Synonyms:
4-[(E)-2-(1,2,3,4-Tetrahydro-1,4-methano-naphthalen-6-yl)-propenyl]-benzoic acid CHEMBL40007
Type:
Small organic molecule
Emp. Form.:
C21H20O2
Mol. Mass.:
304.3823
SMILES:
C\C(=C/c1ccc(cc1)C(O)=O)c1ccc2C3CCC(C3)c2c1
: