Target
Transmembrane domain-containing protein TMIGD3
Ligand
BDBM50500482
Substrate
Meas. Tech.
ChEMBL_1543581 (CHEMBL3750699)
Ki
2291±n/a nM
Citation
 Ranganathan, AStoddart, LAHill, SJCarlsson, J Fragment-Based Discovery of Subtype-Selective Adenosine Receptor Ligands from Homology Models. J Med Chem 58:9578-90 (2015)  
Target
Name:
Transmembrane domain-containing protein TMIGD3
Synonyms:
TMIG3_HUMAN Transmembrane domain-containing protein TMIGD3
Type:
PROTEIN
Mol. Mass.:
30335.79
Organism:
Homo sapiens (Human)
Description:
ChEMBL_114868
Residue:
266
  
Inhibitor
Name:
BDBM50500482
Synonyms:
CHEMBL1536674
Type:
Small organic molecule
Emp. Form.:
C12H15N3OS
Mol. Mass.:
249.332
SMILES:
CCc1cc2c(O)nc(nc2s1)N1CCCC1
: