Target
Transmembrane domain-containing protein TMIGD3
Ligand
BDBM68331
Substrate
Meas. Tech.
ChEMBL_1543581 (CHEMBL3750699)
Ki
331±n/a nM
Citation
 Ranganathan, AStoddart, LAHill, SJCarlsson, J Fragment-Based Discovery of Subtype-Selective Adenosine Receptor Ligands from Homology Models. J Med Chem 58:9578-90 (2015)  
Target
Name:
Transmembrane domain-containing protein TMIGD3
Synonyms:
TMIG3_HUMAN Transmembrane domain-containing protein TMIGD3
Type:
PROTEIN
Mol. Mass.:
30335.79
Organism:
Homo sapiens (Human)
Description:
ChEMBL_114868
Residue:
266
  
Inhibitor
Name:
BDBM68331
Synonyms:
N-(1,3-benzothiazol-2-yl)-1-benzothiophene-2-carboxamide SR-03000000815-1 | cid_8379104
Type:
Small organic molecule
Emp. Form.:
C16H10N2OS2
Mol. Mass.:
310.393
SMILES:
O=C(Nc1nc2ccccc2s1)c1cc2ccccc2s1
: