Target
Transmembrane domain-containing protein TMIGD3
Ligand
BDBM50500485
Substrate
Meas. Tech.
ChEMBL_1543581 (CHEMBL3750699)
Ki
550±n/a nM
Citation
 Ranganathan, AStoddart, LAHill, SJCarlsson, J Fragment-Based Discovery of Subtype-Selective Adenosine Receptor Ligands from Homology Models. J Med Chem 58:9578-90 (2015)  
Target
Name:
Transmembrane domain-containing protein TMIGD3
Synonyms:
TMIG3_HUMAN Transmembrane domain-containing protein TMIGD3
Type:
PROTEIN
Mol. Mass.:
30335.79
Organism:
Homo sapiens (Human)
Description:
ChEMBL_114868
Residue:
266
  
Inhibitor
Name:
BDBM50500485
Synonyms:
CHEMBL3745803
Type:
Small organic molecule
Emp. Form.:
C12H10N2O2S
Mol. Mass.:
246.285
SMILES:
CCc1cc2c(nc([nH]c2=O)-c2ccoc2)s1
: