Target
Transmembrane domain-containing protein TMIGD3
Ligand
BDBM50500486
Substrate
Meas. Tech.
ChEMBL_1543581 (CHEMBL3750699)
Ki
398±n/a nM
Citation
 Ranganathan, AStoddart, LAHill, SJCarlsson, J Fragment-Based Discovery of Subtype-Selective Adenosine Receptor Ligands from Homology Models. J Med Chem 58:9578-90 (2015)  
Target
Name:
Transmembrane domain-containing protein TMIGD3
Synonyms:
TMIG3_HUMAN Transmembrane domain-containing protein TMIGD3
Type:
PROTEIN
Mol. Mass.:
30335.79
Organism:
Homo sapiens (Human)
Description:
ChEMBL_114868
Residue:
266
  
Inhibitor
Name:
BDBM50500486
Synonyms:
CHEMBL3745825
Type:
Small organic molecule
Emp. Form.:
C12H10N2O2S
Mol. Mass.:
246.285
SMILES:
Cc1sc2nc([nH]c(=O)c2c1C)-c1ccoc1
: