Target
Retinoic acid receptor alpha
Ligand
BDBM50051553
Substrate
Meas. Tech.
ChEMBL_197404 (CHEMBL799794)
Kd
68±n/a nM
Citation
 Yu, KLSpinazze, POstrowski, JCurrier, SJPack, EJHammer, LRoalsvig, THoneyman, JATortolani, DRReczek, PRMansuri, MMStarrett, JE Retinoic acid receptor beta,gamma-selective ligands: synthesis and biological activity of 6-substituted 2-naphthoic acid retinoids. J Med Chem 39:2411-21 (1996)  
Target
Name:
Retinoic acid receptor alpha
Synonyms:
NR1B1 RAR-alpha RARA_HUMAN Retinoic acid receptor alpha/Retinoid X receptor alpha Retinoid receptor
Type:
PROTEIN
Mol. Mass.:
50778.87
Organism:
Homo sapiens (Human)
Description:
ChEMBL_1466191
Residue:
462
  
Inhibitor
Name:
BDBM50051553
Synonyms:
6-[1-(5,5,8,8-Tetramethyl-5,6,7,8-tetrahydro-naphthalen-2-yl)-vinyl]-naphthalene-2-carboxylic acid | CHEMBL82716
Type:
Small organic molecule
Emp. Form.:
C27H28O2
Mol. Mass.:
384.51
SMILES:
CC1(C)CCC(C)(C)c2cc(ccc12)C(=C)c1ccc2cc(ccc2c1)C(O)=O
: