Target
Retinoic acid receptor alpha
Ligand
BDBM50051556
Substrate
Meas. Tech.
ChEMBL_197404 (CHEMBL799794)
Kd
6500±n/a nM
Citation
 Yu, KLSpinazze, POstrowski, JCurrier, SJPack, EJHammer, LRoalsvig, THoneyman, JATortolani, DRReczek, PRMansuri, MMStarrett, JE Retinoic acid receptor beta,gamma-selective ligands: synthesis and biological activity of 6-substituted 2-naphthoic acid retinoids. J Med Chem 39:2411-21 (1996)  
Target
Name:
Retinoic acid receptor alpha
Synonyms:
NR1B1 RAR-alpha RARA_HUMAN Retinoic acid receptor alpha/Retinoid X receptor alpha Retinoid receptor
Type:
PROTEIN
Mol. Mass.:
50778.87
Organism:
Homo sapiens (Human)
Description:
ChEMBL_1466191
Residue:
462
  
Inhibitor
Name:
BDBM50051556
Synonyms:
6-[Methoxy-(5,5,8,8-tetramethyl-5,6,7,8-tetrahydro-naphthalen-2-yl)-methyl]-naphthalene-2-carboxylic acid | CHEMBL78835
Type:
Small organic molecule
Emp. Form.:
C27H30O3
Mol. Mass.:
402.5253
SMILES:
COC(c1ccc2c(c1)C(C)(C)CCC2(C)C)c1ccc2cc(ccc2c1)C(O)=O
: