Target
Retinoic acid receptor beta
Ligand
BDBM50052033
Substrate
Meas. Tech.
ChEMBL_195655 (CHEMBL796050)
EC50
24.0±n/a nM
Citation
 Zhang, LNadzan, AMHeyman, RALove, DLMais, DECroston, GLamph, WWBoehm, MF Discovery of novel retinoic acid receptor agonists having potent antiproliferative activity in cervical cancer cells. J Med Chem 39:2659-63 (1996)  
Target
Name:
Retinoic acid receptor beta
Synonyms:
HAP NR1B2 RAR-beta RARB Retinoic acid receptor RXR-alpha/Retinoic acid receptor beta Retinoid receptor
Type:
PROTEIN
Mol. Mass.:
50498.70
Organism:
Homo sapiens (Human)
Description:
ChEMBL_1458015
Residue:
455
  
Inhibitor
Name:
BDBM50052033
Synonyms:
(2E,4E,6E)-7-(3,5-Di-tert-butyl-phenyl)-3-methyl-octa-2,4,6-trienoic acid CHEMBL89241
Type:
Small organic molecule
Emp. Form.:
C23H32O2
Mol. Mass.:
340.499
SMILES:
C\C(\C=C\C=C(/C)c1cc(cc(c1)C(C)(C)C)C(C)(C)C)=C/C(O)=O
: