Target
Retinoic acid receptor alpha
Ligand
BDBM50052413
Substrate
Meas. Tech.
ChEMBL_195320 (CHEMBL799875)
Kd
4.4±n/a nM
Citation
 Teng, MDuong, TTKlein, ESPino, MEChandraratna, RA Identification of a retinoic acid receptor alpha subtype specific agonist. J Med Chem 39:3035-8 (1996)  
Target
Name:
Retinoic acid receptor alpha
Synonyms:
NR1B1 RAR-alpha RARA_HUMAN Retinoic acid receptor alpha/Retinoid X receptor alpha Retinoid receptor
Type:
PROTEIN
Mol. Mass.:
50778.87
Organism:
Homo sapiens (Human)
Description:
ChEMBL_1466191
Residue:
462
  
Inhibitor
Name:
BDBM50052413
Synonyms:
4-[(4-Bromo-3-hydroxy-5,5,8,8-tetramethyl-5,6,7,8-tetrahydro-naphthalene-2-carbonyl)-amino]-2-fluoro-benzoic acid | CHEMBL317873
Type:
Small organic molecule
Emp. Form.:
C22H23BrFNO4
Mol. Mass.:
464.325
SMILES:
CC1(C)CCC(C)(C)c2c(Br)c(O)c(cc12)C(=O)Nc1ccc(C(O)=O)c(F)c1
: