Target
Retinoic acid receptor gamma
Ligand
BDBM50045268
Substrate
Meas. Tech.
ChEMBL_196321 (CHEMBL806264)
Kd
26±n/a nM
Citation
 Teng, MDuong, TTKlein, ESPino, MEChandraratna, RA Identification of a retinoic acid receptor alpha subtype specific agonist. J Med Chem 39:3035-8 (1996)  
Target
Name:
Retinoic acid receptor gamma
Synonyms:
NR1B3 RAR-gamma RARG_HUMAN Retinoic acid receptor gamma | Retinoid receptor
Type:
PROTEIN
Mol. Mass.:
50345.43
Organism:
Homo sapiens (Human)
Description:
ChEMBL_1458016
Residue:
454
  
Inhibitor
Name:
BDBM50045268
Synonyms:
4-[(Z)-2-(5,5,8,8-Tetramethyl-5,6,7,8-tetrahydro-naphthalen-2-yl)-propenyl]-benzoic acid CHEMBL86663
Type:
Small organic molecule
Emp. Form.:
C24H28O2
Mol. Mass.:
348.4779
SMILES:
C\C(=C\c1ccc(cc1)C(O)=O)c1ccc2c(c1)C(C)(C)CCC2(C)C
: