Target
Retinoic acid receptor alpha
Ligand
BDBM50052589
Substrate
Meas. Tech.
ChEMBL_197383 (CHEMBL799702)
EC50
4±n/a nM
Citation
 Canan Koch, SSDardashti, LJHebert, JJWhite, SKCroston, GEFlatten, KSHeyman, RANadzan, AM Identification of the first retinoid X, receptor homodimer antagonist. J Med Chem 39:3229-34 (1996)  
Target
Name:
Retinoic acid receptor alpha
Synonyms:
NR1B1 RAR-alpha RARA_HUMAN Retinoic acid receptor alpha/Retinoid X receptor alpha Retinoid receptor
Type:
PROTEIN
Mol. Mass.:
50778.87
Organism:
Homo sapiens (Human)
Description:
ChEMBL_1466191
Residue:
462
  
Inhibitor
Name:
BDBM50052589
Synonyms:
(2E,4E,6Z)-3-Methyl-7-(5,5,8,8-tetramethyl-3-propoxy-5,6,7,8-tetrahydro-naphthalen-2-yl)-octa-2,4,6-trienoic acid CHEMBL109581
Type:
Small organic molecule
Emp. Form.:
C26H36O3
Mol. Mass.:
396.5622
SMILES:
CCCOc1cc2c(cc1\C(C)=C/C=C/C(/C)=C/C(O)=O)C(C)(C)CCC2(C)C
: