Target
Retinoic acid receptor RXR-beta
Ligand
BDBM50052958
Substrate
Meas. Tech.
ChEMBL_197068 (CHEMBL806657)
Kd
302±n/a nM
Citation
 Beard, RLColon, DFSong, TKDavies, PJKochhar, DMChandraratna, RA Synthesis and structure-activity relationships of retinoid X receptor selective diaryl sulfide analogs of retinoic acid. J Med Chem 39:3556-63 (1996)  
Target
Name:
Retinoic acid receptor RXR-beta
Synonyms:
Nr2b2 Retinoid X receptor beta | Rxrb
Type:
PROTEIN
Mol. Mass.:
55877.78
Organism:
Mus musculus
Description:
ChEMBL_196588
Residue:
520
  
Inhibitor
Name:
BDBM50052958
Synonyms:
4-(3,5,5,8,8-Pentamethyl-5,6,7,8-tetrahydro-naphthalen-2-ylsulfanyl)-benzoic acid | CHEMBL118693
Type:
Small organic molecule
Emp. Form.:
C22H26O2S
Mol. Mass.:
354.506
SMILES:
Cc1cc2c(cc1Sc1ccc(cc1)C(O)=O)C(C)(C)CCC2(C)C
: