Target
Retinoic acid receptor beta
Ligand
BDBM50052957
Substrate
Meas. Tech.
ChEMBL_195642 (CHEMBL795960)
Kd
10000±n/a nM
Citation
 Beard, RLColon, DFSong, TKDavies, PJKochhar, DMChandraratna, RA Synthesis and structure-activity relationships of retinoid X receptor selective diaryl sulfide analogs of retinoic acid. J Med Chem 39:3556-63 (1996)  
Target
Name:
Retinoic acid receptor beta
Synonyms:
Nr1b2 RAR-beta Rarb
Type:
PROTEIN
Mol. Mass.:
53344.93
Organism:
Mus musculus
Description:
ChEMBL_195641
Residue:
482
  
Inhibitor
Name:
BDBM50052957
Synonyms:
4-(3,5,5,8,8-Pentamethyl-5,6,7,8-tetrahydro-naphthalene-2-sulfonyl)-benzoic acid | CHEMBL118307
Type:
Small organic molecule
Emp. Form.:
C22H26O4S
Mol. Mass.:
386.504
SMILES:
Cc1cc2c(cc1S(=O)(=O)c1ccc(cc1)C(O)=O)C(C)(C)CCC2(C)C
: