Target
Acetylcholine receptor subunit epsilon
Ligand
BDBM8961
Substrate
Meas. Tech.
ChEMBL_1867236 (CHEMBL4368211)
Ki
152±n/a nM
Citation
 Xu, MPeng, YZhu, LWang, SJi, JRakesh, KP Triazole derivatives as inhibitors of Alzheimer's disease: Current developments and structure-activity relationships. Eur J Med Chem 180:656-672 (2019)  
Target
Name:
Acetylcholine receptor subunit epsilon
Synonyms:
ACHE_HUMAN Acetylcholine receptor protein epsilon chain Nicotinic acetylcholine receptor alpha-1/beta-1/delta/epsilon
Type:
PROTEIN
Mol. Mass.:
54686.87
Organism:
Homo sapiens (Human)
Description:
ChEMBL_431077
Residue:
493
  
Inhibitor
Name:
BDBM8961
Synonyms:
1,2,3,4-tetrahydro-9-acridinamine 9-THA CHEMBL1337960 Cognex Tracine cid_1935 | tacrine.HCl
Type:
Small organic molecule
Emp. Form.:
C13H14N2
Mol. Mass.:
198.2637
SMILES:
Nc1c2CCCCc2nc2ccccc12
: