Target
Retinoic acid receptor RXR-beta
Ligand
BDBM50074297
Substrate
Meas. Tech.
ChEMBL_197076 (CHEMBL806664)
EC50
25±n/a nM
Citation
 Canan Koch, SSDardashti, LJCesario, RMCroston, GEBoehm, MFHeyman, RANadzan, AM Synthesis of retinoid X receptor-specific ligands that are potent inducers of adipogenesis in 3T3-L1 cells. J Med Chem 42:742-50 (1999)  
Target
Name:
Retinoic acid receptor RXR-beta
Synonyms:
NR2B2 RXRB Retinoic acid receptor RXR-beta Retinoid receptor
Type:
PROTEIN
Mol. Mass.:
56932.89
Organism:
Homo sapiens (Human)
Description:
ChEMBL_39045
Residue:
533
  
Inhibitor
Name:
BDBM50074297
Synonyms:
4-[[(E)-Cyanomethoxyimino]-(3,5,5,8,8-pentamethyl-5,6,7,8-tetrahydro-naphthalen-2-yl)-methyl]-benzoic acid | CHEMBL164902
Type:
Small organic molecule
Emp. Form.:
C25H28N2O3
Mol. Mass.:
404.5014
SMILES:
Cc1cc2c(cc1\C(=N\OCC#N)c1ccc(cc1)C(O)=O)C(C)(C)CCC2(C)C
: