Target
Growth factor receptor-bound protein 2
Ligand
BDBM50075017
Substrate
Meas. Tech.
ChEBML_72349
IC50
7.0±n/a nM
Citation
 Burke, TRLuo, JYao, ZJGao, YZhao, HMilne, GWGuo, RVoigt, JHKing, CRYang, D Monocarboxylic-based phosphotyrosyl mimetics in the design of GRB2 SH2 domain inhibitors. Bioorg Med Chem Lett 9:347-52 (1999)  
Target
Name:
Growth factor receptor-bound protein 2
Synonyms:
ASH GRB2 adapter protein Grb2-SH2 | Growth factor receptor-bound protein 2
Type:
Protein
Mol. Mass.:
25205.04
Organism:
Homo sapiens (Human)
Description:
P62993
Residue:
217
  
Inhibitor
Name:
BDBM50075017
Synonyms:
CHEMBL332862 | Phosphoric acid mono-[4-((R)-2-acetylamino-2-{1-[(S)-2-carbamoyl-1-(3-naphthalen-1-yl-propylcarbamoyl)-ethylcarbamoyl]-cyclohexylcarbamoyl}-ethyl)-phenyl] ester
Type:
Small organic molecule
Emp. Form.:
C35H44N5O9P
Mol. Mass.:
709.7257
SMILES:
CC(=O)N[C@H](Cc1ccc(OP(O)(O)=O)cc1)C(=O)NC1(CCCCC1)C(=O)N[C@@H](CC(N)=O)C(=O)NCCCc1cccc2ccccc12
: