Target
Plasmepsin II
Ligand
BDBM8019
Substrate
Meas. Tech.
ChEMBL_154909 (CHEMBL764684)
Ki
4.3±n/a nM
Citation
 Haque, TSSkillman, AGLee, CEHabashita, HGluzman, IYEwing, TJGoldberg, DEKuntz, IDEllman, JA Potent, low-molecular-weight non-peptide inhibitors of malarial aspartyl protease plasmepsin II. J Med Chem 42:1428-40 (1999)  
Target
Name:
Plasmepsin II
Synonyms:
Aspartic hemoglobinase II PLM2_PLAFX Plasmepsin 2 Plasmepsin-II
Type:
Enzyme
Mol. Mass.:
51482.09
Organism:
Plasmodium falciparum
Description:
P46925
Residue:
453
  
Inhibitor
Name:
BDBM8019
Synonyms:
2-(3-chlorophenoxy)-N-[(2S,3S)-3-hydroxy-4-{N-[2-(4-methoxyphenyl)ethyl]piperidin-4-ylformamido}-1-phenylbutan-2-yl]acetamide hydroxyethylamine-based inhibitor 3
Type:
Small organic molecule
Emp. Form.:
C33H40ClN3O5
Mol. Mass.:
594.141
SMILES:
COc1ccc(CCN(C[C@H](O)[C@H](Cc2ccccc2)NC(=O)COc2cccc(Cl)c2)C(=O)C2CCNCC2)cc1
: