Target
Retinoic acid receptor beta
Ligand
BDBM31883
Substrate
Meas. Tech.
ChEMBL_1899798 (CHEMBL4401913)
EC50
1.2±n/a nM
Citation
 Goncalves, MBClarke, EJarvis, CIBarret Kalindjian, SPitcher, TGrist, JHobbs, CCarlstedt, TJack, JBrown, JTMills, MMumford, PBorthwick, ADCorcoran, JPT Discovery and lead optimisation of a potent, selective and orally bioavailable RAR? agonist for the potential treatment of nerve injury. Bioorg Med Chem Lett 29:995-1000 (2019)  
Target
Name:
Retinoic acid receptor beta
Synonyms:
Nr1b2 RAR-beta Rarb
Type:
PROTEIN
Mol. Mass.:
53344.93
Organism:
Mus musculus
Description:
ChEMBL_195641
Residue:
482
  
Inhibitor
Name:
BDBM31883
Synonyms:
9-cis-retinoic acid (9cRA) AT-RA CHEMBL38 SMR000058245 Vitamin A acid [3H]Retinoic acid [3H]tretinoin cid_444795
Type:
radiolabeled ligand
Emp. Form.:
C20H28O2
Mol. Mass.:
300.4351
SMILES:
C\C(\C=C\C1=C(C)CCCC1(C)C)=C/C=C/C(/C)=C/C(O)=O
: