Target
Retinoic acid receptor alpha
Ligand
BDBM50526323
Substrate
Meas. Tech.
ChEMBL_1899797 (CHEMBL4401912)
EC50
240±n/a nM
Citation
 Goncalves, MBClarke, EJarvis, CIBarret Kalindjian, SPitcher, TGrist, JHobbs, CCarlstedt, TJack, JBrown, JTMills, MMumford, PBorthwick, ADCorcoran, JPT Discovery and lead optimisation of a potent, selective and orally bioavailable RAR? agonist for the potential treatment of nerve injury. Bioorg Med Chem Lett 29:995-1000 (2019)  
Target
Name:
Retinoic acid receptor alpha
Synonyms:
Nr1b1 Rara
Type:
PROTEIN
Mol. Mass.:
50742.79
Organism:
Mus musculus
Description:
ChEMBL_195182
Residue:
462
  
Inhibitor
Name:
BDBM50526323
Synonyms:
CHEMBL4539676
Type:
Small organic molecule
Emp. Form.:
C18H13Cl2NO3S
Mol. Mass.:
394.272
SMILES:
CCOc1c(Cl)cc(cc1Cl)-c1csc(n1)-c1ccc(cc1)C(O)=O
: