Target
Retinoic acid receptor gamma
Ligand
BDBM50526325
Substrate
Meas. Tech.
ChEMBL_1899800 (CHEMBL4401915)
EC50
9.0±n/a nM
Citation
 Goncalves, MBClarke, EJarvis, CIBarret Kalindjian, SPitcher, TGrist, JHobbs, CCarlstedt, TJack, JBrown, JTMills, MMumford, PBorthwick, ADCorcoran, JPT Discovery and lead optimisation of a potent, selective and orally bioavailable RAR? agonist for the potential treatment of nerve injury. Bioorg Med Chem Lett 29:995-1000 (2019)  
Target
Name:
Retinoic acid receptor gamma
Synonyms:
Nr1b3 Rarg
Type:
PROTEIN
Mol. Mass.:
50896.02
Organism:
Mus musculus
Description:
ChEMBL_196161
Residue:
458
  
Inhibitor
Name:
BDBM50526325
Synonyms:
CHEMBL4438880 | US10752616, Code No. BHBA-021
Type:
Small organic molecule
Emp. Form.:
C19H14N2O3S
Mol. Mass.:
350.391
SMILES:
Cc1ccc(C)c2sc(cc12)-c1nc(no1)-c1ccc(cc1)C(O)=O
: