Target
Cytochrome P450 3A4
Ligand
BDBM50526314
Substrate
Meas. Tech.
ChEMBL_1899810 (CHEMBL4401925)
IC50
>25000±n/a nM
Citation
 Goncalves, MBClarke, EJarvis, CIBarret Kalindjian, SPitcher, TGrist, JHobbs, CCarlstedt, TJack, JBrown, JTMills, MMumford, PBorthwick, ADCorcoran, JPT Discovery and lead optimisation of a potent, selective and orally bioavailable RAR? agonist for the potential treatment of nerve injury. Bioorg Med Chem Lett 29:995-1000 (2019)  
Target
Name:
Cytochrome P450 3A4
Synonyms:
Albendazole monooxygenase CP3A4_HUMAN CYP3A4 CYPIIIA4 Cytochrome P450 3A4 (CYP3A4) Nifedipine oxidase Taurochenodeoxycholate 6-alpha-hydroxylase
Type:
Enzyme
Mol. Mass.:
57349.57
Organism:
Homo sapiens (Human)
Description:
Residue:
503
  
Inhibitor
Name:
BDBM50526314
Synonyms:
CHEMBL4459692 | US10752616, Code No. BHBA-001
Type:
Small organic molecule
Emp. Form.:
C19H14N2O4
Mol. Mass.:
334.3255
SMILES:
Cc1ccc(C)c2oc(cc12)-c1nc(no1)-c1ccc(cc1)C(O)=O
: