Target
Retinoic acid receptor RXR-gamma
Ligand
BDBM50530344
Substrate
Meas. Tech.
ChEMBL_1911887 (CHEMBL4414333)
EC50
360±n/a nM
Citation
 Pollinger, JGellrich, LSchierle, SKilu, WSchmidt, JKalinowsky, LOhrndorf, JKaiser, AHeering, JProschak, EMerk, D Tuning Nuclear Receptor Selectivity of Wy14,643 towards Selective Retinoid X Receptor Modulation. J Med Chem 62:2112-2126 (2019)  
Target
Name:
Retinoic acid receptor RXR-gamma
Synonyms:
NR2B3 RXRG Retinoic acid receptor RXR-gamma Retinoid X receptor gamma/retinoic acid receptor alpha
Type:
PROTEIN
Mol. Mass.:
50878.26
Organism:
Homo sapiens (Human)
Description:
ChEMBL_197216
Residue:
463
  
Inhibitor
Name:
BDBM50530344
Synonyms:
CHEMBL4558880
Type:
Small organic molecule
Emp. Form.:
C18H18F3N3O3
Mol. Mass.:
381.349
SMILES:
CN(c1cc(nc(OCCC(O)=O)n1)C(F)(F)F)c1cccc2CCCc12
: