Target
Retinoic acid receptor RXR-beta
Ligand
BDBM50530345
Substrate
Meas. Tech.
ChEMBL_1911886 (CHEMBL4414332)
EC50
22300±n/a nM
Citation
 Pollinger, JGellrich, LSchierle, SKilu, WSchmidt, JKalinowsky, LOhrndorf, JKaiser, AHeering, JProschak, EMerk, D Tuning Nuclear Receptor Selectivity of Wy14,643 towards Selective Retinoid X Receptor Modulation. J Med Chem 62:2112-2126 (2019)  
Target
Name:
Retinoic acid receptor RXR-beta
Synonyms:
NR2B2 RXRB Retinoic acid receptor RXR-beta Retinoid receptor
Type:
PROTEIN
Mol. Mass.:
56932.89
Organism:
Homo sapiens (Human)
Description:
ChEMBL_39045
Residue:
533
  
Inhibitor
Name:
BDBM50530345
Synonyms:
CHEMBL4439052
Type:
Small organic molecule
Emp. Form.:
C15H17N3O2S
Mol. Mass.:
303.379
SMILES:
Cc1cc(Nc2cccc(C)c2C)nc(SCC(O)=O)n1
: