Target
Nuclear receptor subfamily 1 group I member 3
Ligand
BDBM50030476
Substrate
Meas. Tech.
ChEMBL_1911948 (CHEMBL4414394)
EC50
49±n/a nM
Citation
 Pollinger, JGellrich, LSchierle, SKilu, WSchmidt, JKalinowsky, LOhrndorf, JKaiser, AHeering, JProschak, EMerk, D Tuning Nuclear Receptor Selectivity of Wy14,643 towards Selective Retinoid X Receptor Modulation. J Med Chem 62:2112-2126 (2019)  
Target
Name:
Nuclear receptor subfamily 1 group I member 3
Synonyms:
CAR NR1I3_HUMAN
Type:
PROTEIN
Mol. Mass.:
39953.17
Organism:
Homo sapiens (Human)
Description:
ChEMBL_1434936
Residue:
352
  
Inhibitor
Name:
BDBM50030476
Synonyms:
CHEMBL458603
Type:
Small organic molecule
Emp. Form.:
C19H12Cl3N3OS
Mol. Mass.:
436.742
SMILES:
Clc1ccc(cc1)-c1nc2sccn2c1\C=N\OCc1ccc(Cl)c(Cl)c1
: