Target
Growth factor receptor-bound protein 2
Ligand
BDBM50085869
Substrate
Meas. Tech.
ChEMBL_72360 (CHEMBL686597)
IC50
2±n/a nM
Citation
 Gao, YLuo, JYao, ZJGuo, RZou, HKelley, JVoigt, JHYang, DBurke, TR Inhibition of Grb2 SH2 domain binding by non-phosphate-containing ligands. 2. 4-(2-Malonyl)phenylalanine as a potent phosphotyrosyl mimetic. J Med Chem 43:911-20 (2000)  
Target
Name:
Growth factor receptor-bound protein 2
Synonyms:
ASH GRB2 adapter protein Grb2-SH2 | Growth factor receptor-bound protein 2
Type:
Protein
Mol. Mass.:
25205.04
Organism:
Homo sapiens (Human)
Description:
P62993
Residue:
217
  
Inhibitor
Name:
BDBM50085869
Synonyms:
CHEMBL367037 | N-[1-(1-{2-Carbamoyl-1-[3-(5-methyl-indol-1-yl)-propylcarbamoyl]-ethylcarbamoyl}-cyclohexylcarbamoyl)-2-(4-phosphonomethyl-phenyl)-ethyl]-oxalamic acid
Type:
Small organic molecule
Emp. Form.:
C35H45N6O10P
Mol. Mass.:
740.7398
SMILES:
Cc1ccc2n(CCCNC(=O)[C@H](CC(N)=O)NC(=O)C3(CCCCC3)NC(=O)[C@H](Cc3ccc(CP(O)(O)=O)cc3)NC(=O)C(O)=O)ccc2c1
: