Target
AMP deaminase 2
Ligand
BDBM50087316
Substrate
Meas. Tech.
ChEMBL_28868 (CHEMBL644200)
Ki
35000±n/a nM
Citation
 Bookser, BCKasibhatla, SRAppleman, JRErion, MD AMP deaminase inhibitors. 2. Initial discovery of a non-nucleotide transition-state inhibitor series. J Med Chem 43:1495-507 (2000)  
Target
Name:
AMP deaminase 2
Synonyms:
AMP deaminase 2 AMPD2 | AMPD2_HUMAN
Type:
Protein
Mol. Mass.:
100694.77
Organism:
Homo sapiens (Human)
Description:
Residue:
879
  
Inhibitor
Name:
BDBM50087316
Synonyms:
CHEMBL35767 | [5-(8-Hydroxy-7,8-dihydro-6H-imidazo[4,5-d][1,3]diazepin-3-yl)-pentyl]-phosphonic acid 1.75H2O
Type:
Small organic molecule
Emp. Form.:
C11H19N4O4P
Mol. Mass.:
302.2667
SMILES:
OC1CNC=Nc2c1ncn2CCCCCP(O)(O)=O
: