Target
Alpha-1D adrenergic receptor
Ligand
BDBM50060964
Substrate
Meas. Tech.
ChEMBL_32438 (CHEMBL646099)
Ki
0.18±n/a nM
Citation
 Kuo, GHProuty, CMurray, WVPulito, VJolliffe, LCheung, PVarga, SEvangelisto, MWang, J Design, synthesis, and structure-activity relationships of phthalimide-phenylpiperazines: a novel series of potent and selective alpha(1)(a)-adrenergic receptor antagonists. J Med Chem 43:2183-95 (2000)  
Target
Name:
Alpha-1D adrenergic receptor
Synonyms:
ADA1D_HUMAN ADRA1D Adrenergic receptor alpha Alpha 1D-adrenoreceptor Alpha-1D adrenoceptor adrenergic Alpha1D
Type:
Enzyme Catalytic Domain
Mol. Mass.:
60485.82
Organism:
Homo sapiens (Human)
Description:
adrenergic Alpha1D ADRA1D HUMAN::P25100
Residue:
572
  
Inhibitor
Name:
BDBM50060964
Synonyms:
(R)-5-(2-((2-(2-ethoxyphenoxy)ethyl)amino)propyl)-2-methoxybenzenesulfonamide 5-[2-[2-(2-ethoxyphenoxy)ethylamino]propyl]-2-methoxy-benzenesulfonamide TAMSULOSIN
Type:
Small organic molecule
Emp. Form.:
C20H28N2O5S
Mol. Mass.:
408.512
SMILES:
CCOc1ccccc1OCCN[C@H](C)Cc1ccc(OC)c(c1)S(N)(=O)=O
: