Target
Cannabinoid receptor 2
Ligand
BDBM50532778
Substrate
Meas. Tech.
ChEMBL_1923902 (CHEMBL4426858)
Ki
0.200000±n/a nM
Citation
 Kulkarni, SNikas, SPSharma, RJiang, SParonis, CALeonard, MZZhang, BHonrao, CMallipeddi, SRaghav, JGBenchama, OJärbe, TUBergman, JMakriyannis, A Novel C-Ring-Hydroxy-Substituted Controlled Deactivation Cannabinergic Analogues. J Med Chem 59:6903-19 (2016)  
Target
Name:
Cannabinoid receptor 2
Synonyms:
CANNABINOID CB2 CB2 Cannabinoid CB2 receptor Cannabinoid receptor 2 mCB2
Type:
Enzyme Catalytic Domain
Mol. Mass.:
38220.43
Organism:
MOUSE
Description:
P47936
Residue:
347
  
Inhibitor
Name:
BDBM50532778
Synonyms:
CHEMBL4465566 | US10882838, Example 3.6
Type:
Small organic molecule
Emp. Form.:
C23H34O5
Mol. Mass.:
390.5131
SMILES:
[H][C@@]12C[C@H](O)CC[C@@]1([H])C(C)(C)Oc1cc(cc(O)c21)C(C)(C)C(=O)OCCCC
: