Target
Acetylcholine receptor subunit alpha/beta/delta/gamma
Ligand
BDBM50089162
Substrate
Meas. Tech.
ChEMBL_144964 (CHEMBL755082)
Ki
830000±n/a nM
Citation
 Takahata, HTakahashi, SAzer, NEldefrawi, ATEldefrawi, ME Total synthesis of pyrrolizidines 223H', 239K', 265H', and 267H' found in Madagascan frogs (Mantella) and their affinities for nicotinic acetylcholine receptor. Bioorg Med Chem Lett 10:1293-5 (2000)  
Target
Name:
Acetylcholine receptor subunit alpha/beta/delta/gamma
Synonyms:
Acetylcholine receptor | Acetylcholine receptor protein alpha/beta/delta/gamma chain
Type:
Mol. Mass.:
Description:
ASSAY_ID of EBI is 143080
Components:
This complex has 4 components.
Component 1
Name:
Acetylcholine receptor subunit beta
Synonyms:
ACHB_TETCF CHRNB1
Type:
PROTEIN
Mol. Mass.:
56146.98
Organism:
Torpedo californica
Description:
EBI_19626
Residue:
493
  
Component 2
Name:
Acetylcholine receptor subunit gamma
Synonyms:
ACHG_TETCF CHRNG
Type:
PROTEIN
Mol. Mass.:
58151.68
Organism:
Torpedo californica
Description:
EBI_19662
Residue:
506
  
Component 3
Name:
Acetylcholine receptor subunit alpha
Synonyms:
ACHA_TETCF Acetylcholine receptor protein alpha chain | CHRNA1
Type:
PROTEIN
Mol. Mass.:
52735.09
Organism:
Torpedo californica
Description:
ChEMBL_216981
Residue:
461
  
Component 4
Name:
Acetylcholine receptor subunit delta
Synonyms:
ACHD_TETCF Acetylcholine receptor protein delta chain | chrnd
Type:
PROTEIN
Mol. Mass.:
59885.01
Organism:
Torpedo californica
Description:
ChEMBL_142744
Residue:
522
  
Inhibitor
Name:
BDBM50089162
Synonyms:
7-((3R,5S,7aR)-5-Propyl-hexahydro-pyrrolizin-3-yl)-heptan-2-one | CHEMBL291009
Type:
Small organic molecule
Emp. Form.:
C17H31NO
Mol. Mass.:
265.4341
SMILES:
CCC[C@H]1CC[C@@H]2CC[C@@H](CCCCCC(C)=O)N12
: