Target
Non-receptor tyrosine-protein kinase TYK2/Tyrosine-protein kinase JAK1/Tyrosine-protein kinase JAK2/Tyrosine-protein kinase JAK3
Ligand
BDBM50536215
Substrate
Meas. Tech.
ChEMBL_1933115 (CHEMBL4478767)
IC50
398±n/a nM
Citation
 Ritzén, ASørensen, MDDack, KNGreve, DRJerre, ACarnerup, MARytved, KABagger-Bahnsen, J Fragment-Based Discovery of 6-Arylindazole JAK Inhibitors. ACS Med Chem Lett 7:641-6 (2016)  
Target
Name:
Non-receptor tyrosine-protein kinase TYK2/Tyrosine-protein kinase JAK1/Tyrosine-protein kinase JAK2/Tyrosine-protein kinase JAK3
Synonyms:
Janus Kinase (JAK)
Type:
Mol. Mass.:
Description:
ASSAY_ID of ChEMBL is 2013355
Components:
This complex has 4 components.
Component 1
Name:
Tyrosine-protein kinase JAK3
Synonyms:
JAK-3 JAK3_HUMAN Janus kinase 3 (JAK3) L-JAK | Leukocyte janus kinase
Type:
Protein
Mol. Mass.:
125111.08
Organism:
Homo sapiens (Human)
Description:
P52333
Residue:
1124
  
Component 2
Name:
Tyrosine-protein kinase JAK1
Synonyms:
JAK-1 JAK1A JAK1_HUMAN Janus kinase 1 (JAK1) | Janus kinase 1 JAK1
Type:
Protein
Mol. Mass.:
133293.73
Organism:
Homo sapiens (Human)
Description:
P23458
Residue:
1154
  
Component 3
Name:
Tyrosine-protein kinase JAK2
Synonyms:
JAK-2 JAK2_HUMAN Janus kinase 2 (JAK2) | Janus kinase 2 (a protein tyrosine kinase)
Type:
Protein
Mol. Mass.:
130684.68
Organism:
Homo sapiens (Human)
Description:
O60674
Residue:
1132
  
Component 4
Name:
Non-receptor tyrosine-protein kinase TYK2
Synonyms:
Non-receptor tyrosine-protein kinase TYK2 (TYK2) TYK2_HUMAN | Tyrosine-protein kinase TYK2
Type:
Protein
Mol. Mass.:
133666.03
Organism:
Homo sapiens (Human)
Description:
P29597
Residue:
1187
  
Inhibitor
Name:
BDBM50536215
Synonyms:
CHEMBL4569613
Type:
Small organic molecule
Emp. Form.:
C18H20FN3O4S
Mol. Mass.:
393.433
SMILES:
CCc1cc(O)c(F)cc1-c1cc(NS(=O)(=O)CCOC)c2cn[nH]c2c1
: