Target
Retinoic acid receptor gamma
Ligand
BDBM50097819
Substrate
Meas. Tech.
ChEBML_196324
Kd
26±n/a nM
Citation
 Beard, RLKlein, ESStandeven, AMEscobar, MChandraratna, RA Phenylcyclohexene and phenylcyclohexadiene substituted compounds having retinoid antagonist activity. Bioorg Med Chem Lett 11:765-8 (2001)  
Target
Name:
Retinoic acid receptor gamma
Synonyms:
NR1B3 RAR-gamma RARG_HUMAN Retinoic acid receptor gamma | Retinoid receptor
Type:
PROTEIN
Mol. Mass.:
50345.43
Organism:
Homo sapiens (Human)
Description:
ChEMBL_1458016
Residue:
454
  
Inhibitor
Name:
BDBM50097819
Synonyms:
4-[(E)-3-(5,5,8,8-Tetramethyl-5,6,7,8-tetrahydro-naphthalen-2-yl)-propenyl]-benzoic acid | CHEMBL165843
Type:
Small organic molecule
Emp. Form.:
C24H28O2
Mol. Mass.:
348.4779
SMILES:
CC1(C)CCC(C)(C)c2cc(C\C=C\c3ccc(cc3)C(O)=O)ccc12
: