Target
Retinoic acid receptor alpha
Ligand
BDBM50097824
Substrate
Meas. Tech.
ChEBML_195195
Kd
135±n/a nM
Citation
 Beard, RLKlein, ESStandeven, AMEscobar, MChandraratna, RA Phenylcyclohexene and phenylcyclohexadiene substituted compounds having retinoid antagonist activity. Bioorg Med Chem Lett 11:765-8 (2001)  
Target
Name:
Retinoic acid receptor alpha
Synonyms:
NR1B1 RAR-alpha RARA_HUMAN Retinoic acid receptor alpha/Retinoid X receptor alpha Retinoid receptor
Type:
PROTEIN
Mol. Mass.:
50778.87
Organism:
Homo sapiens (Human)
Description:
ChEMBL_1466191
Residue:
462
  
Inhibitor
Name:
BDBM50097824
Synonyms:
4-[(E)-4-(2,6,6-Trimethyl-cyclohex-1-enyl)-but-3-en-1-ynyl]-benzoic acid | CHEMBL151870
Type:
Small organic molecule
Emp. Form.:
C20H22O2
Mol. Mass.:
294.3875
SMILES:
CC1=C(\C=C\C#Cc2ccc(cc2)C(O)=O)C(C)(C)CCC1
: