Target
Retinoic acid receptor beta
Ligand
BDBM50029774
Substrate
Meas. Tech.
ChEMBL_195813 (CHEMBL807724)
Kd
7±n/a nM
Citation
 Beard, RLKlein, ESStandeven, AMEscobar, MChandraratna, RA Phenylcyclohexene and phenylcyclohexadiene substituted compounds having retinoid antagonist activity. Bioorg Med Chem Lett 11:765-8 (2001)  
Target
Name:
Retinoic acid receptor beta
Synonyms:
HAP NR1B2 RAR-beta RARB Retinoic acid receptor RXR-alpha/Retinoic acid receptor beta Retinoid receptor
Type:
PROTEIN
Mol. Mass.:
50498.70
Organism:
Homo sapiens (Human)
Description:
ChEMBL_1458015
Residue:
455
  
Inhibitor
Name:
BDBM50029774
Synonyms:
4-(5,5-Dimethyl-8-p-tolyl-5,6-dihydro-naphthalen-2-ylethynyl)-benzoic acid | CHEMBL358145
Type:
Small organic molecule
Emp. Form.:
C28H24O2
Mol. Mass.:
392.489
SMILES:
Cc1ccc(cc1)C1=CCC(C)(C)c2ccc(cc12)C#Cc1ccc(cc1)C(O)=O
: