Target
Retinoic acid receptor beta
Ligand
BDBM50097820
Substrate
Meas. Tech.
ChEBML_195651
IC50
53±n/a nM
Citation
 Beard, RLKlein, ESStandeven, AMEscobar, MChandraratna, RA Phenylcyclohexene and phenylcyclohexadiene substituted compounds having retinoid antagonist activity. Bioorg Med Chem Lett 11:765-8 (2001)  
Target
Name:
Retinoic acid receptor beta
Synonyms:
HAP NR1B2 RAR-beta RARB Retinoic acid receptor RXR-alpha/Retinoic acid receptor beta Retinoid receptor
Type:
PROTEIN
Mol. Mass.:
50498.70
Organism:
Homo sapiens (Human)
Description:
ChEMBL_1458015
Residue:
455
  
Inhibitor
Name:
BDBM50097820
Synonyms:
4-[(E)-4-(3,3-Dimethyl-6-p-tolyl-cyclohexa-1,5-dienyl)-but-3-en-1-ynyl]-benzoic acid | CHEMBL350485
Type:
Small organic molecule
Emp. Form.:
C26H24O2
Mol. Mass.:
368.4676
SMILES:
Cc1ccc(cc1)C1=CCC(C)(C)C=C1\C=C\C#Cc1ccc(cc1)C(O)=O
: