Target
Retinoic acid receptor alpha
Ligand
BDBM31883
Substrate
Meas. Tech.
ChEMBL_195324 (CHEMBL799719)
Kd
14±n/a nM
Citation
 Beard, RLKlein, ESStandeven, AMEscobar, MChandraratna, RA Phenylcyclohexene and phenylcyclohexadiene substituted compounds having retinoid antagonist activity. Bioorg Med Chem Lett 11:765-8 (2001)  
Target
Name:
Retinoic acid receptor alpha
Synonyms:
NR1B1 RAR-alpha RARA_HUMAN Retinoic acid receptor alpha/Retinoid X receptor alpha Retinoid receptor
Type:
PROTEIN
Mol. Mass.:
50778.87
Organism:
Homo sapiens (Human)
Description:
ChEMBL_1466191
Residue:
462
  
Inhibitor
Name:
BDBM31883
Synonyms:
9-cis-retinoic acid (9cRA) AT-RA CHEMBL38 SMR000058245 Vitamin A acid [3H]Retinoic acid [3H]tretinoin cid_444795
Type:
radiolabeled ligand
Emp. Form.:
C20H28O2
Mol. Mass.:
300.4351
SMILES:
C\C(\C=C\C1=C(C)CCCC1(C)C)=C/C=C/C(/C)=C/C(O)=O
: