Target
Acidic mammalian chitinase
Ligand
BDBM50541950
Substrate
Meas. Tech.
ChEMBL_1985608 (CHEMBL4619014)
IC50
0.700000±n/a nM
Citation
 Andryianau, GKowalski, MPiotrowicz, MCRajkiewicz, AADymek, BSklepkiewicz, PLPluta, EStefaniak, FCzestkowski, WOlejniczak, SMazur, MNiedziejko, PKoralewski, RMatyszewski, KGruza, MZagozdzon, ASalamon, MRymaszewska, AWelzer, MDzwonek, KGolab, JOlczak, JBartoszewicz, AGolebiowski, A Benzoxazepine-Derived Selective, Orally Bioavailable Inhibitor of Human Acidic Mammalian Chitinase. ACS Med Chem Lett 11:1228-1235 (2020)  
Target
Name:
Acidic mammalian chitinase
Synonyms:
AMCase CHIA Lung-specific protein TSA1902
Type:
Protein
Mol. Mass.:
52266.66
Organism:
Homo sapiens (Human)
Description:
Q9BZP6
Residue:
476
  
Inhibitor
Name:
BDBM50541950
Synonyms:
CHEMBL4643001
Type:
Small organic molecule
Emp. Form.:
C24H29Cl2N7
Mol. Mass.:
486.44
SMILES:
CN1C[C@H](Cc2ccc(Cl)cc2)N(Cc2cc(Cl)ccc12)C1CCN(CC1)c1n[nH]c(N)n1
: