Target
Retinoic acid receptor beta
Ligand
BDBM50101444
Substrate
Meas. Tech.
ChEMBL_163476 (CHEMBL772311)
Kd
20500±n/a nM
Citation
 Vuligonda, VThacher, SMChandraratna, RA Enantioselective syntheses of potent retinoid X receptor ligands: differential biological activities of individual antipodes. J Med Chem 44:2298-303 (2001)  
Target
Name:
Retinoic acid receptor beta
Synonyms:
HAP NR1B2 RAR-beta RARB Retinoic acid receptor RXR-alpha/Retinoic acid receptor beta Retinoid receptor
Type:
PROTEIN
Mol. Mass.:
50498.70
Organism:
Homo sapiens (Human)
Description:
ChEMBL_1458015
Residue:
455
  
Inhibitor
Name:
BDBM50101444
Synonyms:
(E)-3-Methyl-5-[2-methyl-2-(5,5,8,8-tetramethyl-5,6,7,8-tetrahydro-naphthalen-2-yl)-cyclopropyl]-penta-2,4-dienoic acid CHEMBL69091
Type:
Small organic molecule
Emp. Form.:
C24H32O2
Mol. Mass.:
352.5097
SMILES:
C\C(\C=C\C1CC1(C)c1ccc2c(c1)C(C)(C)CCC2(C)C)=C/C(O)=O
: