Target
Non-receptor tyrosine-protein kinase TYK2
Ligand
BDBM305812
Substrate
Meas. Tech.
ChEMBL_2021996 (CHEMBL4675809)
IC50
8.0±n/a nM
Citation
 Gerstenberger, BSAmbler, CArnold, EPBanker, MEBrown, MFClark, JDDermenci, ADowty, MEFensome, AFish, SHayward, MMHegen, MHollingshead, BDKnafels, JDLin, DWLin, THOwen, DRSaiah, ESharma, RVajdos, FFXing, LYang, XYang, XWright, SW Discovery of Tyrosine Kinase 2 (TYK2) Inhibitor (PF-06826647) for the Treatment of Autoimmune Diseases. J Med Chem 63:13561-13577 (2020)  
Target
Name:
Non-receptor tyrosine-protein kinase TYK2
Synonyms:
Non-receptor tyrosine-protein kinase TYK2 (TYK2) TYK2_HUMAN | Tyrosine-protein kinase TYK2
Type:
Protein
Mol. Mass.:
133666.03
Organism:
Homo sapiens (Human)
Description:
P29597
Residue:
1187
  
Inhibitor
Name:
BDBM305812
Synonyms:
2,2′-((1s,3s)-1-(4-(6-(1-Methyl-1H-pyrazol-4-yl)pyrazolo[1,5-a]pyrazin-4-yl)-1H-pyrazol-1-yl)cyclobutane-1,3-diyl)diacetonitrile (cis isomer) US10822341, Example 11 | US11472809, Example 11
Type:
Small organic molecule
Emp. Form.:
C21H19N9
Mol. Mass.:
397.4359
SMILES:
Cn1cc(cn1)-c1cn2nccc2c(n1)-c1cnn(c1)[C@]1(CC#N)C[C@H](CC#N)C1
: