Target
Bile acid receptor
Ligand
BDBM50510491
Substrate
Meas. Tech.
ChEMBL_2035579 (CHEMBL4689737)
IC50
7.0±n/a nM
Citation
 Teno, NIguchi, YOda, KYamashita, YMasuda, AFujimori, KUne, MGohda, K Discovery of Orally Active and Nonsteroidal Farnesoid X Receptor (FXR) Antagonist with Propensity for Accumulation and Responsiveness in Ileum. ACS Med Chem Lett 12:420-425 (2021)  
Target
Name:
Bile acid receptor
Synonyms:
BAR FXR HRR1 NR1H4_HUMAN RIP14 Retinoid X receptor-interacting protein 14 | farnesoid x receptor
Type:
Nuclear Receptor
Mol. Mass.:
55916.24
Organism:
Homo sapiens (Human)
Description:
Q96RI1
Residue:
486
  
Inhibitor
Name:
BDBM50510491
Synonyms:
CHEMBL4552760
Type:
Small organic molecule
Emp. Form.:
C36H41N5O5
Mol. Mass.:
623.7412
SMILES:
COc1ccc(Oc2ccc(cc2)N2CC(=O)N([C@@H](CC3CCN(CC3)C(=O)C(C)C)c3nc4ccc(C)cc4n3C)C2=O)cc1
: