Target
Bile acid receptor
Ligand
BDBM50553000
Substrate
Meas. Tech.
ChEMBL_2035580 (CHEMBL4689738)
IC50
0.050000±n/a nM
Citation
 Teno, NIguchi, YOda, KYamashita, YMasuda, AFujimori, KUne, MGohda, K Discovery of Orally Active and Nonsteroidal Farnesoid X Receptor (FXR) Antagonist with Propensity for Accumulation and Responsiveness in Ileum. ACS Med Chem Lett 12:420-425 (2021)  
Target
Name:
Bile acid receptor
Synonyms:
BAR FXR HRR1 NR1H4_HUMAN RIP14 Retinoid X receptor-interacting protein 14 | farnesoid x receptor
Type:
Nuclear Receptor
Mol. Mass.:
55916.24
Organism:
Homo sapiens (Human)
Description:
Q96RI1
Residue:
486
  
Inhibitor
Name:
BDBM50553000
Synonyms:
CHEMBL4783205
Type:
Small organic molecule
Emp. Form.:
C36H37F2N5O4
Mol. Mass.:
641.7069
SMILES:
CC(C)C(=O)N1CCC(C[C@H](N2C(=O)CN(C2=O)c2ccc(Oc3ccc(F)cc3)cc2)c2nc3ccc(F)cc3n2C2CC2)CC1
: