Target
Acidic mammalian chitinase
Ligand
BDBM50554345
Substrate
Meas. Tech.
ChEMBL_2049319 (CHEMBL4704018)
IC50
6.7±n/a nM
Target
Name:
Acidic mammalian chitinase
Synonyms:
AMCase Chia YNL
Type:
PROTEIN
Mol. Mass.:
51991.60
Organism:
Mus musculus
Description:
ChEMBL_828636
Residue:
473
  
Inhibitor
Name:
BDBM50554345
Synonyms:
CHEMBL4789376
Type:
Small organic molecule
Emp. Form.:
C19H27ClN6O2
Mol. Mass.:
406.91
SMILES:
Nc1n[nH]c(n1)N1CCC(CC1)N1C[C@H](CO)OC[C@@H]1Cc1ccc(Cl)cc1
: