Target
Acid ceramidase
Ligand
BDBM50556790
Substrate
Meas. Tech.
ChEMBL_2057391 (CHEMBL4712392)
IC50
13±n/a nM
Citation
 Caputo, SDi Martino, SCilibrasi, VTardia, PMazzonna, MRusso, DPenna, ISumma, MBertozzi, SMRealini, NMargaroli, NMigliore, MOttonello, GLiu, MLansbury, PArmirotti, ABertorelli, RRay, SSSkerlj, RScarpelli, R Design, Synthesis, and Biological Evaluation of a Series of Oxazolone Carboxamides as a Novel Class of Acid Ceramidase Inhibitors. J Med Chem 63:15821-15851 (2020)  
Target
Name:
Acid ceramidase
Synonyms:
ASAH ASAH1_HUMAN Acid ceramidase (AC)
Type:
Enzyme
Mol. Mass.:
44662.65
Organism:
Homo sapiens (Human)
Description:
Q13510
Residue:
395
  
Inhibitor
Name:
BDBM50556790
Synonyms:
CHEMBL4777626
Type:
Small organic molecule
Emp. Form.:
C16H24ClN3O5
Mol. Mass.:
373.832
SMILES:
CCCCCCNC(=O)n1cc(Cl)c(=O)n(C(=O)OCC(C)C)c1=O
: