Target
Acyl-protein thioesterase 1
Ligand
BDBM50557417
Substrate
Meas. Tech.
ChEMBL_2059145 (CHEMBL4714146)
IC50
1.000000±n/a nM
Citation
 Jung, HJNam, EHPark, JYGhosh, PKim, IS Identification of BR102910 as a selective fibroblast activation protein (FAP) inhibitor. Bioorg Med Chem Lett 37:0 (2021)  
Target
Name:
Acyl-protein thioesterase 1
Synonyms:
Acyl-protein thioesterase 1/2 LYPA1_RAT Lysosomal phospholipase A1
Type:
PROTEIN
Mol. Mass.:
24708.49
Organism:
Rattus norvegicus
Description:
ChEMBL_12731
Residue:
230
  
Inhibitor
Name:
BDBM50557417
Synonyms:
CHEMBL4762591
Type:
Small organic molecule
Emp. Form.:
C18H14Cl2F2N4O2S
Mol. Mass.:
459.297
SMILES:
FC1(F)C[C@@H](C#N)N(C1)C(=O)CNC(=O)c1csc(Cc2ccc(Cl)cc2Cl)n1
: