Target
Retinoic acid receptor alpha
Ligand
BDBM50120063
Substrate
Meas. Tech.
ChEMBL_32960 (CHEMBL644524)
Kd
3±n/a nM
Citation
 Beard, RLDuong, TTTeng, MKlein, ESStandevan, AMChandraratna, RA Synthesis and biological activity of retinoic acid receptor-alpha specific amides. Bioorg Med Chem Lett 12:3145-8 (2002)  
Target
Name:
Retinoic acid receptor alpha
Synonyms:
NR1B1 RAR-alpha RARA_HUMAN Retinoic acid receptor alpha/Retinoid X receptor alpha Retinoid receptor
Type:
PROTEIN
Mol. Mass.:
50778.87
Organism:
Homo sapiens (Human)
Description:
ChEMBL_1466191
Residue:
462
  
Inhibitor
Name:
BDBM50120063
Synonyms:
2,6-Difluoro-4-[(3-hydroxy-5,5,8,8-tetramethyl-5,6,7,8-tetrahydro-naphthalene-2-carbonyl)-amino]-benzoic acid | CHEMBL107054
Type:
Small organic molecule
Emp. Form.:
C22H23F2NO4
Mol. Mass.:
403.4191
SMILES:
CC1(C)CCC(C)(C)c2cc(C(=O)Nc3cc(F)c(C(O)=O)c(F)c3)c(O)cc12
: