Target
Poly [ADP-ribose] polymerase 1
Ligand
BDBM50120723
Substrate
Meas. Tech.
ChEMBL_159659 (CHEMBL761787)
Ki
8±n/a nM
Citation
 Canan Koch, SSThoresen, LHTikhe, JGMaegley, KAAlmassy, RJLi, JYu, XHZook, SEKumpf, RAZhang, CBoritzki, TJMansour, RNZhang, KEEkker, ACalabrese, CRCurtin, NJKyle, SThomas, HDWang, LZCalvert, AHGolding, BTGriffin, RJNewell, DRWebber, SEHostomsky, Z Novel tricyclic poly(ADP-ribose) polymerase-1 inhibitors with potent anticancer chemopotentiating activity: design, synthesis, and X-ray cocrystal structure. J Med Chem 45:4961-74 (2002)  
Target
Name:
Poly [ADP-ribose] polymerase 1
Synonyms:
(ARTD1 or PARP1) 2.4.2.30 ADPRT ARTD1 Human diphtheria toxin-like ADP-ribosyltransferase (ARTD1 or PARP1) NT-PARP-1 PARP1 PPOL Poly [ADP-ribose] polymerase 1 (PARP) Poly [ADP-ribose] polymerase 1 (PARP1) Poly [ADP-ribose] polymerase 1, 28-kDa form Poly [ADP-ribose] polymerase 1, processed C-terminus Poly [ADP-ribose] polymerase-1 Poly(ADP-ribose) polymerase-1 (ARTD1/PARP1) Protein poly-ADP-ribosyltransferase PARP1 | Synonyms=ADPRT
Type:
Mol. Mass.:
113114.22
Organism:
Homo sapiens (Human)
Description:
P09874
Residue:
1014
  
Inhibitor
Name:
BDBM50120723
Synonyms:
2-(3-Dimethylaminomethyl-phenyl)-1,3,4,5-tetrahydro-azepino[5,4,3-cd]indol-6-one | CHEMBL146943
Type:
Small organic molecule
Emp. Form.:
C20H21N3O
Mol. Mass.:
319.4002
SMILES:
CN(C)Cc1cccc(c1)-c1[nH]c2cccc3C(=O)NCCc1c23
: