Target
Retinoic acid receptor RXR-alpha
Ligand
BDBM50129724
Substrate
Meas. Tech.
ChEMBL_196768 (CHEMBL798929)
Ki
3±n/a nM
Citation
 Michellys, PYArdecky, RJChen, JHCrombie, DLEtgen, GJFaul, MMFaulkner, ALGrese, TAHeyman, RAKaranewsky, DSKlausing, KLeibowitz, MDLiu, SMais, DAMapes, CMMarschke, KBReifel-Miller, AOgilvie, KMRungta, DThompson, AWTyhonas, JSBoehm, MF Novel (2E,4E,6Z)-7-(2-alkoxy-3,5-dialkylbenzene)-3-methylocta-2,4,6-trienoic acid retinoid X receptor modulators are active in models of type 2 diabetes. J Med Chem 46:2683-96 (2003)  
Target
Name:
Retinoic acid receptor RXR-alpha
Synonyms:
NR2B1 Nuclear receptor subfamily 4 group A member 2 RXRA Retinoic acid receptor RXR-alpha/gamma Retinoid receptor
Type:
PROTEIN
Mol. Mass.:
50820.38
Organism:
Homo sapiens (Human)
Description:
ChEMBL_1456363
Residue:
462
  
Inhibitor
Name:
BDBM50129724
Synonyms:
7-(3,5-Diisopropyl-2-propoxy-phenyl)-3-methyl-octa-2,4,6-trienoic acid | CHEMBL91779
Type:
Small organic molecule
Emp. Form.:
C24H34O3
Mol. Mass.:
370.525
SMILES:
CCCOc1c(cc(cc1\C(C)=C/C=C/C(/C)=C/C(O)=O)C(C)C)C(C)C
: