Target
Retinoic acid receptor RXR-gamma
Ligand
BDBM50129720
Substrate
Meas. Tech.
ChEMBL_197230 (CHEMBL801376)
Ki
12±n/a nM
Citation
 Michellys, PYArdecky, RJChen, JHD'Arrigo, JGrese, TAKaranewsky, DSLeibowitz, MDLiu, SMais, DAMapes, CMMontrose-Rafizadeh, COgilvie, KMReifel-Miller, ARungta, DThompson, AWTyhonas, JSBoehm, MF Design, synthesis, and structure-activity relationship studies of novel 6,7-locked-[7-(2-alkoxy-3,5-dialkylbenzene)-3-methylocta]-2,4,6-trienoic acids. J Med Chem 46:4087-103 (2003)  
Target
Name:
Retinoic acid receptor RXR-gamma
Synonyms:
Nr2b3 Retinoid X receptor gamma | Rxrg
Type:
PROTEIN
Mol. Mass.:
50901.38
Organism:
Rattus norvegicus
Description:
ChEMBL_197230
Residue:
463
  
Inhibitor
Name:
BDBM50129720
Synonyms:
(2E,4E,6Z)-7-[3,5-Di-tert-butyl-2-(2,2-difluoro-ethoxy)-phenyl]-3-methyl-octa-2,4,6-trienoic acid CHEMBL42314
Type:
Small organic molecule
Emp. Form.:
C25H34F2O3
Mol. Mass.:
420.5325
SMILES:
C\C(\C=C\C=C(\C)c1cc(cc(c1OCC(F)F)C(C)(C)C)C(C)(C)C)=C/C(O)=O
: