Target
Retinoic acid receptor, alpha, isoform CRA_b
Ligand
BDBM50133125
Substrate
Meas. Tech.
ChEMBL_195190 (CHEMBL802723)
Ki
>10000±n/a nM
Citation
 Michellys, PYArdecky, RJChen, JHD'Arrigo, JGrese, TAKaranewsky, DSLeibowitz, MDLiu, SMais, DAMapes, CMMontrose-Rafizadeh, COgilvie, KMReifel-Miller, ARungta, DThompson, AWTyhonas, JSBoehm, MF Design, synthesis, and structure-activity relationship studies of novel 6,7-locked-[7-(2-alkoxy-3,5-dialkylbenzene)-3-methylocta]-2,4,6-trienoic acids. J Med Chem 46:4087-103 (2003)  
Target
Name:
Retinoic acid receptor, alpha, isoform CRA_b
Synonyms:
Retinoic acid receptor alpha
Type:
PROTEIN
Mol. Mass.:
50955.52
Organism:
Rattus norvegicus
Description:
ChEMBL_195190
Residue:
459
  
Inhibitor
Name:
BDBM50133125
Synonyms:
5-{3-[3,5-Diisopropyl-2-(2,2,2-trifluoro-ethoxy)-phenyl]-pyridin-4-yl}-3-methyl-penta-2,4-dienoic acid | CHEMBL130577
Type:
Small organic molecule
Emp. Form.:
C25H28F3NO3
Mol. Mass.:
447.4899
SMILES:
CC(C)c1cc(C(C)C)c(OCC(F)(F)F)c(c1)-c1cnccc1\C=C\C(\C)=C\C(O)=O
: