Target
Retinoic acid receptor RXR-alpha
Ligand
BDBM50132580
Substrate
Meas. Tech.
ChEBML_44518
Ki
7.8±n/a nM
Citation
 Michellys, PYBoehm, MFChen, JHGrese, TAKaranewsky, DSLeibowitz, MDLiu, SMais, DAMapes, CMReifel-Miller, AOgilvie, KMRungta, DThompson, AWTyhonas, JSYumibe, NArdecky, RJ Design and synthesis of novel RXR-selective modulators with improved pharmacological profile. Bioorg Med Chem Lett 13:4071-5 (2003)  
Target
Name:
Retinoic acid receptor RXR-alpha
Synonyms:
NR2B1 Nuclear receptor subfamily 4 group A member 2 RXRA Retinoic acid receptor RXR-alpha/gamma Retinoid receptor
Type:
PROTEIN
Mol. Mass.:
50820.38
Organism:
Homo sapiens (Human)
Description:
ChEMBL_1456363
Residue:
462
  
Inhibitor
Name:
BDBM50132580
Synonyms:
(2E,4E,6E)-7-[3,5-Di-tert-butyl-2-(2,2-difluoro-ethoxy)-phenyl]-6-fluoro-3-methyl-octa-2,4,6-trienoic acid | CHEMBL111217
Type:
Small organic molecule
Emp. Form.:
C25H33F3O3
Mol. Mass.:
438.5229
SMILES:
C\C(\C=C\C(\F)=C(\C)c1cc(cc(c1OCC(F)F)C(C)(C)C)C(C)(C)C)=C/C(O)=O
: