Target
Retinoic acid receptor RXR-beta
Ligand
BDBM50135459
Substrate
Meas. Tech.
ChEBML_196926
Ki
24±n/a nM
Citation
 Michellys, PYBoehm, MFChen, JHGrese, TAKaranewsky, DSLeibowitz, MDLiu, SMais, DAMapes, CMReifel-Miller, AOgilvie, KMRungta, DThompson, AWTyhonas, JSYumibe, NArdecky, RJ Design and synthesis of novel RXR-selective modulators with improved pharmacological profile. Bioorg Med Chem Lett 13:4071-5 (2003)  
Target
Name:
Retinoic acid receptor RXR-beta
Synonyms:
NR2B2 RXRB Retinoic acid receptor RXR-beta Retinoid receptor
Type:
PROTEIN
Mol. Mass.:
56932.89
Organism:
Homo sapiens (Human)
Description:
ChEMBL_39045
Residue:
533
  
Inhibitor
Name:
BDBM50135459
Synonyms:
(2E,4E,6E)-7-(2-Butoxy-3,5-diisopropyl-phenyl)-6-fluoro-3-methyl-octa-2,4,6-trienoic acid | CHEMBL131826
Type:
Small organic molecule
Emp. Form.:
C25H35FO3
Mol. Mass.:
402.542
SMILES:
CCCCOc1c(cc(cc1\C(C)=C(\F)/C=C/C(/C)=C/C(O)=O)C(C)C)C(C)C
: